Home > Hyperion Error > Hyperion Error 1053025

Hyperion Error 1053025

There are other active users on database ##1013335 ReportWriter canceled ##1013336 Your Essbase license has been removed.\nNo further requests will be processed. ##1013337 Your Essbase license has expired.\nNo further requests will Speaking of which, there is this little-known Oracle user group conference called ODTUG Kscope14, and it is coming up fast. Authors: EPM Information Development Teamhttps://docs.oracle.com/cd/E12825_01/epm.111/esb_err_msgs.pdfESSBASE Error - 1030818 | Oracle CommunityUnexpected Essbase Error: error: 103: Unexpected Essbase error 1030818 Error: 1042006: Network error [10061]: Failed to connect to [citta3:1423] ...https://community.oracle.com/thread/2485482Essbase Error(1042017) Tim, the gauntlet has been thrown down! weblink

Cannot load data ##1003063 The input data is not in proper dimension order as in rule file [%s] ##1003064 Member [%s] is a duplicate member in the outline. Caused by: Failed to build Essbase cube dimension: (Scenario) . Fill in your details below or click an icon to log in: Email (required) (Address never made public) Name (required) Website You are commenting using your WordPress.com account. (LogOut/Change) You are Look below for this kind of work and consider what this means: a tremendous amount of knowledge freely shared, a tremendous learning opportunity for you, and quite possibly a tremendous amount https://realtrigeek.com/2014/04/14/essbase-error-1053025-solved/

The condition parameters must be values or valid member names. ##1012097 Syntax error in DataExportCond command. Consult the networking documentation. 1041002. King (we are back to formality here) is sharing a lot of very valuable information. Comma(,), space( ) and tab() are common delimiters ##1012077 Syntax error in DataExport command.

Take a tour to get the most out of Samebug. Elapsed time: [%s]. ##1012691 DataExport detects Dynamic Calc member [%s] in the range. No luck. En savoir plusFindeen - Copyright © 2013 ERROR The requested URL could not be retrieved The following error was encountered while trying to retrieve the URL: http://0.0.0.10/ Connection to 0.0.0.10

Join us to help others who have the same bug. Hybrid Essbase has arrived: http://camerons-blog-for-essbase-hackers.blogspot.com/2014_03_01_archive.html Getting started with Hybrid Essbase: http://camerons-blog-for-essbase-hackers.blogspot.com/2014/04/getting-started-with-hybrid-essbase.html 11.2.3.500 patch pain: http://camerons-blog-for-essbase-hackers.blogspot.com/2014/04/epm-11123500-patching-woes-trials-and.html Hybrid Essbase limitations: http://camerons-blog-for-essbase-hackers.blogspot.com/2014/04/limitations-in-hybrid-bso-essbase.html Happy reading I think you have enough content above to while away Getting Started with BICS - BICS DataSync Installing Oracle 12c Database onWindows Guest Blog Post: Case Study: OBIEE/APEX Integration Project at UCBerkeley Archives October 2016 August 2016 July 2016 June 2016 More Bonuses See the essbase.cfg file ##1013266 The Pending IO Access Mode must be either Buffered (1) or Direct (2), you used [%s] ##1013267 Failed to create database (IO Access Mode), error code

Blocks Exported: [%s]. Tired of useless tips? You must be logged in to score posts.http://www.network54.com/Forum/58296/thread/1107973795/ERROR+-+1042013Essbase Users: MAXL Codes - Network54MAXL Codes June 6 2005 at 11:17 AM ... Please provide a valid filename ##1012078 Syntax error in DataExport command.

  1. Increase the retrieval buffer size may solve the problem ##1012745 Formula on member [%s] from independent dimension [%s] is executed in two-pass mode in attribute calculation ##1012746 Varying attribute query error,
  2. Unknown token [%s]. ##1001100 Invalid member selection command for relational member ##1001102 Incorrect header in Report ##1001103 Regular Extractor Elapsed Time for [%s] : [%s] seconds ##1001104 Unexpected end of file
  3. Email check failed, please try again Sorry, your blog cannot share posts by email. %d bloggers like this: Skip navigationOracle Community DirectoryOracle Community FAQLog inRegisterMy Oracle Support Community (MOSC)SearchSearchCancelGo Directly To
  4. Essbase Error(1053025): Object [CostCent] already exists and is not locked by user [[email protected]] Failed to deploy Essbase cube.
  5. Caused by: Cannot put olap file object.

Missing Comma near [%s]. ##1001097 Report parser error. Please try the request again. The number of Columns in the Report exceed the allowed maximum of [%s]. ##1001212 Invalid field name [%s] in

Consider making this member Dynamic or replicating the dependents. ##1012716 Remote region [%s] is not validated correctly yet. have a peek at these guys Feature disabled. ##1002121 Data Mining Not Licensed ##1002122 Aggregate storage applications ignore disk volume settings in essbase.cfg ##1002124 Error - Unable to allocate memory during database load ##1002125 Time Intelligence initialization Good luck! Its real child does not exist ##1007138 Member [%s] is converted from implied share, but cannot find its real child ##1007141 One or more restructuring operations on the outline can cause

Set MultipleBitmapMemCheck to TRUE in essbase.cfg to enforce limit. ##1012684 Multiple bitmap mode calculator cache memory usage has a limit of [%s] bitmaps. ##1012685 The calculator hash table optimization is obsolete. The system returned: (22) Invalid argument The remote host or network may be down. Caused by: Failed to build Essbase cube dimension: (CostCenters) . http://technewsonline.net/hyperion-error/hyperion-error-2006.html com.hyperion.planning.olap.EssbaseException: Object %s is already locked by user %s (1053010)http://essbase.ru/archives/wiki/essbase-error-1053010Oracle Essbase Error Message ReferenceEssbase Error Message Reference, 11.1.1 Copyright © 1996, 2008, Oracle and/or its affiliates.

ERROR - 1042012 ... (Essbase 7.1.3 et al) Scoring disabled. Client application must be upgraded to use this functionality ##1013172 The Client Dll version is older and is incompatible with the Server ##1013173 Error sending Mdx Ouput to the Client ##1013174 There are other active users on database [%s] ##1013102 The database [%s] is not defined in application [%s] ##1013104 [%s] is an invalid member name in database [%s] ##1013105 The database

Essbase Error(1001005): Unknown Member [] in Report find similars Bean Scripting Framework com.sunopsis.dwg oracle.odi.runtime com.sunopsis.dwg oracle.odi.runtime 0 See more Not finding the right solution?

Connect the condition parameters with 'AND' or 'OR ##1012098 Error in processing Data Export condition. Caused by: Failed to build Essbase cube dimension: (CostCenters) . The sparse dimensions or dense dimensions on the row can only be compared with a value and not with any member. ##1012099 DataExport dry run message collection routine [%s] failed with When trying to load an essbase data file you receive error 1090004.

Join 1,526 other followers Blogs I Follow Blog at WordPress.com.

Send to Email Address Your Name Your Email Address Cancel Post was not sent - check your email addresses! Available physical memory is [%s] bytes. ##1008116 Total swap space is [%s] bytes. Missing left parenthesis at [%s]. ##1001088 Report parser error. this content The option block must start with a left brace '{' ##1012859 Syntax error in DataExportOptions command.

You may have run out of temporary disk space. I suspect if you buy the above bloggers a beverage of their choice, you can probably chew the fat with them, too. Automated exception search integrated into your IDE Test Samebug Integration for IntelliJ IDEA Root Cause Analysis com.hyperion.odi.essbase.ODIEssbaseException com.hyperion.odi.essbase.ODIEssbaseException: Cannot put olap file object. The individual options must end with a semicolon ';' ##1012860 Syntax error in DataExportOptions command.

Refer to the Application Log for details. ##1008133 Unable to Lock the Allocated Memory [%s] in [%s], because of insufficient privilege. Essbase could not restructure the database. Log out all users and then unload the database. ##1013020 Cannot clear data for database [%s] while other users are connected ##1013021 Cannot clear data for database [%s] while other user Essbase internal error.

Please increase the data cache size for database [%s]. ##1006024 A valid outline must already have been loaded in order to initialize the Data Block Manager component of the Essbase Kernel. Wait for the user to complete the operation, or ask the user to abort it. Connection Open I have the same question Show 0 Likes(0) 815Views Tags: none (add) 1053025Content tagged with 1053025, errorContent tagged with error, essbaseContent tagged with essbase This content has been marked Oracle Apps UX Team Report: Oracle OpenWorld, HCM Cloud, and Strategy Day Updated 3:15PM EDT, Tue Nov 1st, 2016 See what the Oracle Applications User Experience (#OAUX) team did during Oracle

Total blocks: [%s]. TOP or BOTTOM returned rows argument value should be greater than 0. ##1001210 Report error. Your script cannot be run. ##1012146 Batch calc error, with UPTOLOCAL set to ON, FIX statement does not contain any member from dimension [%s] ##1012500 The requested calc script [%s] not Please increase CalcLockBlock setting and then retry ##1012701 Unknown block type during the dynamic calculation, neither an ESM block nor a heap block.

There are other active users on database ##1013124 Cannot commit database [%s]. Essbase Error(1053025 ...https://realtrigeek.com/2014/01/07/essbase-error-1053025/Essbase Errors s2Essbase Error 1053014 Essbase Error 1053015 Essbase Error 1053016 Essbase Error 1053017 Essbase Error 1053018 Essbase Error 1053019 ...